Target
Non-receptor tyrosine-protein kinase TYK2 [888-1187]
Ligand
BDBM410155
Substrate
Meas. Tech.
Caliper mobility shift assay
IC50
>10000±n/a nM
Citation
 Gauvry, NTahtaoui, CFuret, PDucray, P Heterocyclyl-substituted cyclohexylsulfonamides as JAK inhibitors US Patent  US10370375 Publication Date 8/6/2019 
Target
Name:
Non-receptor tyrosine-protein kinase TYK2 [888-1187]
Synonyms:
Non-receptor tyrosine-protein kinase TYK2 (aa 888-1187) TYK2 (aa 888-1187) | TYK2_HUMAN
Type:
Protein
Mol. Mass.:
34527.73
Organism:
Homo sapiens (Human)
Description:
P29597[888-1187]
Residue:
300
  
Inhibitor
Name:
BDBM410155
Synonyms:
US10370375, Example 3
Type:
Small organic molecule
Emp. Form.:
C13H21N7O2S
Mol. Mass.:
339.417
SMILES:
CNS(=O)(=O)C[C@H]1CCC(CC1)N(C)c1ncnc2[nH]nnc12
: