Target
Tyrosine-protein kinase JAK1 [866-1154]
Ligand
BDBM410171
Substrate
Meas. Tech.
Caliper mobility shift assay
IC50
>10000±n/a nM
Citation
 Gauvry, NTahtaoui, CFuret, PDucray, P Heterocyclyl-substituted cyclohexylsulfonamides as JAK inhibitors US Patent  US10370375 Publication Date 8/6/2019 
Target
Name:
Tyrosine-protein kinase JAK1 [866-1154]
Synonyms:
JAK1 JAK1A JAK1_HUMAN Tyrosine-protein kinase JAK1 (aa 866-1154)
Type:
Protein
Mol. Mass.:
33185.74
Organism:
Homo sapiens (Human)
Description:
P23458[866-1154]
Residue:
289
  
Inhibitor
Name:
BDBM410171
Synonyms:
US10370375, Example 19
Type:
Small organic molecule
Emp. Form.:
C15H21N3O2S2
Mol. Mass.:
339.476
SMILES:
CNS(=O)(=O)C[C@H]1CCC(CC1)Nc1ccnc2sccc12
: