Target
High affinity nerve growth factor receptor
Ligand
BDBM410205
Substrate
Meas. Tech.
Enzyme Assay
IC50
55±n/a nM
Citation
 Wenglowsky, SMMiduturu, CVBifulco, Jr., NKim, JL Compounds and compositions useful for treating disorders related to NTRK US Patent  US10370379 Publication Date 8/6/2019 
Target
Name:
High affinity nerve growth factor receptor
Synonyms:
2.7.10.1 NTRK1 NTRK1_HUMAN Neurotrophic tyrosine kinase receptor type 1 Synonyms=MTC TRK1-transforming tyrosine kinase protein TRKA GN Tropomyosin alpha-3 chain/High affinity nerve growth factor receptor Tropomyosin-related kinase A (TrkA) Tyrosine kinase receptor (Trk) Tyrosine kinase receptor A (Trk A) Tyrosine kinase receptor A (TrkA) p140-TrkA
Type:
Mol. Mass.:
87498.18
Organism:
Homo sapiens (Human)
Description:
P04629
Residue:
796
  
Inhibitor
Name:
BDBM410205
Synonyms:
US10370379, Compound 22 | US11059827, Compound 22
Type:
Small organic molecule
Emp. Form.:
C18H14F2N6O
Mol. Mass.:
368.3402
SMILES:
NC(=O)c1ccc(F)cc1[C@H]1C[C@H](F)CN1c1ccn2ncc(C#N)c2n1
: