Target
Tyrosine-protein kinase JAK1 [837-1142]
Ligand
BDBM344031
Substrate
Meas. Tech.
In Vitro JAK Kinase Assay
IC50
<2000±n/a nM
Citation
 Li, YZhu, WMei, S Tricyclic fused thiophene derivatives as JAK inhibitors US Patent  US10370387 Publication Date 8/6/2019 
Target
Name:
Tyrosine-protein kinase JAK1 [837-1142]
Synonyms:
JAK1 JAK1A JAK1_HUMAN Tyrosine-protein kinase JAK1 (837-1142) | Tyrosine-protein kinase JAK1 (aa 837-1142)
Type:
Mol. Mass.:
35230.04
Organism:
Homo sapiens (Human)
Description:
P23458[837-1142]
Residue:
306
  
Inhibitor
Name:
BDBM344031
Synonyms:
US10370387, Example 15 US9777017, Example 15 | US9908895, Example 15
Type:
Small organic molecule
Emp. Form.:
C17H19F3N4OS
Mol. Mass.:
384.419
SMILES:
C[C@@H](O)c1nc2cnc3ccsc3c2n1C1CCN(CC(F)(F)F)CC1
: