Target
Tyrosine-protein kinase JAK2 [828-1132]
Ligand
BDBM375666
Substrate
Meas. Tech.
In Vitro JAK Kinase Assay
IC50
<1000±n/a nM
Citation
 Li, YZhu, WMei, S Tricyclic fused thiophene derivatives as JAK inhibitors US Patent  US10370387 Publication Date 8/6/2019 
Target
Name:
Tyrosine-protein kinase JAK2 [828-1132]
Synonyms:
JAK2 Tyrosine-protein kinase JAK2 (aa 828-1132)
Type:
Enzyme Catalytic Domain
Mol. Mass.:
35522.23
Organism:
Homo sapiens (Human)
Description:
aa 828-1132
Residue:
304
  
Inhibitor
Name:
BDBM375666
Synonyms:
US10370387, Example 40 US9908895, Example 40 | US9908895, Example 41
Type:
Small organic molecule
Emp. Form.:
C18H20N4OS
Mol. Mass.:
340.443
SMILES:
CCc1nc2cnc3ccsc3c2n1[C@H]1CC[C@H](CC#N)[C@@H](O)C1
: