Target
Tyrosine-protein kinase JAK2 [828-1132]
Ligand
BDBM344075
Substrate
Meas. Tech.
In Vitro JAK Kinase Assay
IC50
>500000±n/a nM
Citation
 Li, YZhu, WMei, S Tricyclic fused thiophene derivatives as JAK inhibitors US Patent  US10370387 Publication Date 8/6/2019 
Target
Name:
Tyrosine-protein kinase JAK2 [828-1132]
Synonyms:
JAK2 Tyrosine-protein kinase JAK2 (aa 828-1132)
Type:
Enzyme Catalytic Domain
Mol. Mass.:
35522.23
Organism:
Homo sapiens (Human)
Description:
aa 828-1132
Residue:
304
  
Inhibitor
Name:
BDBM344075
Synonyms:
US10370387, Example 59 US9777017, Example 59 | US9908895, Example 59
Type:
Small organic molecule
Emp. Form.:
C20H23N5O2S
Mol. Mass.:
397.494
SMILES:
C[C@@H](O)c1nc2cnc3ccsc3c2n1[C@H]1CCCN(C1)C(=O)CCCC#N
: