Target
Type-2 angiotensin II receptor
Ligand
BDBM318796
Substrate
Meas. Tech.
Receptor Binding Assay
IC50
461±n/a nM
Citation
 McCarthy, TDNaylor, A Heterocyclic compounds and methods of their use US Patent  US10370388 Publication Date 8/6/2019 
Target
Name:
Type-2 angiotensin II receptor
Synonyms:
AGTR2 AT2 Angiotensin II type 2 (AT-2) receptor Type-2 angiotensin II receptor
Type:
Enzyme Catalytic Domain
Mol. Mass.:
41201.61
Organism:
Homo sapiens (Human)
Description:
Angiotensin II, central 0 0::P50052
Residue:
363
  
Inhibitor
Name:
BDBM318796
Synonyms:
(2S,4S)-1-(2,2-diphenylacetyl)-4-(3-phenylthiophen-2-yl)-pyrrolidine-2-carboxylic acid US9624243, 107
Type:
Small organic molecule
Emp. Form.:
C29H25NO3S
Mol. Mass.:
467.579
SMILES:
OC(=O)[C@@H]1C[C@@H](CN1C(=O)C(c1ccccc1)c1ccccc1)c1sccc1-c1ccccc1
: