Target
Type-2 angiotensin II receptor
Ligand
BDBM318816
Substrate
Meas. Tech.
Receptor Binding Assay
IC50
173±n/a nM
Citation
 McCarthy, TDNaylor, A Heterocyclic compounds and methods of their use US Patent  US10370388 Publication Date 8/6/2019 
Target
Name:
Type-2 angiotensin II receptor
Synonyms:
AGTR2 AT2 Angiotensin II type 2 (AT-2) receptor Type-2 angiotensin II receptor
Type:
Enzyme Catalytic Domain
Mol. Mass.:
41201.61
Organism:
Homo sapiens (Human)
Description:
Angiotensin II, central 0 0::P50052
Residue:
363
  
Inhibitor
Name:
BDBM318816
Synonyms:
(2S,4S)-1-(2,2diphenylacetyl)-4˜03-(4-fluorophenyl)propyl)(methyl)amino)pyrrolidine-2-carbonitrile US9624243, 137
Type:
Small organic molecule
Emp. Form.:
C29H30FN3O
Mol. Mass.:
455.5664
SMILES:
CN(CCCc1ccc(F)cc1)[C@H]1C[C@@H](C#N)N(C1)C(=O)C(c1ccccc1)c1ccccc1
: