Target
Orexin/Hypocretin receptor type 1
Ligand
BDBM50230164
Substrate
Meas. Tech.
Measurement of Antagonistic Activity Against Orexin Receptors
IC50
30.0±n/a nM
Citation
 Nagase, HYamamoto, NIrukayama, YSaitoh, TYanagisawa, MNagumo, Y Morphinan derivative and medical usage thereof US Patent  US10377763 Publication Date 8/13/2019 
Target
Name:
Orexin/Hypocretin receptor type 1
Synonyms:
HCRTR1 OX1R_HUMAN Orexin receptor type 1 (OR 1) Orexin receptor type 1 (OX1) Orexin receptor type 1 (OxR1) | Ox1r
Type:
Protein
Mol. Mass.:
47554.50
Organism:
Homo sapiens (Human)
Description:
O43613
Residue:
425
  
Inhibitor
Name:
BDBM50230164
Synonyms:
CHEMBL4091834 | US10377763, Example 2
Type:
Small organic molecule
Emp. Form.:
C32H34N2O7S
Mol. Mass.:
590.687
SMILES:
[H][C@@]12Oc3c4c(C[C@@]5([H])N(CC[C@@]14[C@@]5(O)CC[C@H]2N(C)C(=O)\C=C\c1ccoc1)S(=O)(=O)c1ccccc1C)ccc3OC
: