Target
Nuclear receptor ROR-gamma
Ligand
BDBM310103
Substrate
Meas. Tech.
RORgamma-Ligand Binding Domain TR-FRET Assay Protocol II
EC50
107±n/a nM
Citation
 Aicher, TDBarr, KJLapointe, BTSimov, VStein, KAThomas, WDToogood, PLVan Huis, CAWhite, CM Tetrahydronaphthyridine and related bicyclic compounds for inhibition of RORgamma activity and the treatment of disease US Patent  US10377768 Publication Date 8/13/2019 
Target
Name:
Nuclear receptor ROR-gamma
Synonyms:
NR1F3 Nuclear receptor ROR-gamma (RORC) RAR-related orphan receptor C (RORc) RORG RZRG Retinoid-related orphan receptor-gamma (RORc)
Type:
Enzyme Catalytic Domain
Mol. Mass.:
58218.40
Organism:
Homo sapiens (Human)
Description:
P51449
Residue:
518
  
Inhibitor
Name:
BDBM310103
Synonyms:
(S)-N-((S)-3-(Acetamidomethyl)-1-(m-tolylsulfonyl)-2,3-dihydro-1H-pyrido[2,3-b][1,4]oxazin-7-yl)-2-phenylpropanamide US9657033, Compound 17
Type:
Small organic molecule
Emp. Form.:
C26H28N4O5S
Mol. Mass.:
508.589
SMILES:
C[C@H](C(=O)Nc1cnc2O[C@@H](CNC(C)=O)CN(c2c1)S(=O)(=O)c1cccc(C)c1)c1ccccc1
: