Target
Nuclear receptor ROR-gamma
Ligand
BDBM310115
Substrate
Meas. Tech.
RORgamma-Ligand Binding Domain TR-FRET Assay Protocol II
EC50
387±n/a nM
Citation
 Aicher, TDBarr, KJLapointe, BTSimov, VStein, KAThomas, WDToogood, PLVan Huis, CAWhite, CM Tetrahydronaphthyridine and related bicyclic compounds for inhibition of RORgamma activity and the treatment of disease US Patent  US10377768 Publication Date 8/13/2019 
Target
Name:
Nuclear receptor ROR-gamma
Synonyms:
NR1F3 Nuclear receptor ROR-gamma (RORC) RAR-related orphan receptor C (RORc) RORG RZRG Retinoid-related orphan receptor-gamma (RORc)
Type:
Enzyme Catalytic Domain
Mol. Mass.:
58218.40
Organism:
Homo sapiens (Human)
Description:
P51449
Residue:
518
  
Inhibitor
Name:
BDBM310115
Synonyms:
US10377768, Compound 29 | US9657033, Compound 29
Type:
Small organic molecule
Emp. Form.:
C23H22FN3O4S
Mol. Mass.:
455.502
SMILES:
C[C@H](C(=O)Nc1cnc2O[C@@H](C)CN(c2c1)S(=O)(=O)c1ccc(F)cc1)c1ccccc1
: