Target
Nuclear receptor ROR-gamma
Ligand
BDBM310176
Substrate
Meas. Tech.
RORgamma-Ligand Binding Domain TR-FRET Assay Protocol II
EC50
32.0±n/a nM
Citation
 Aicher, TDBarr, KJLapointe, BTSimov, VStein, KAThomas, WDToogood, PLVan Huis, CAWhite, CM Tetrahydronaphthyridine and related bicyclic compounds for inhibition of RORgamma activity and the treatment of disease US Patent  US10377768 Publication Date 8/13/2019 
Target
Name:
Nuclear receptor ROR-gamma
Synonyms:
NR1F3 Nuclear receptor ROR-gamma (RORC) RAR-related orphan receptor C (RORc) RORG RZRG Retinoid-related orphan receptor-gamma (RORc)
Type:
Enzyme Catalytic Domain
Mol. Mass.:
58218.40
Organism:
Homo sapiens (Human)
Description:
P51449
Residue:
518
  
Inhibitor
Name:
BDBM310176
Synonyms:
US10377768, Compound 89 | US9657033, Compound 89
Type:
Small organic molecule
Emp. Form.:
C25H23Cl3N4O5S
Mol. Mass.:
597.898
SMILES:
O[C@@H]1CCN(C[C@H]2CN(c3cc(NC(=O)c4c(Cl)cccc4Cl)cnc3O2)S(=O)(=O)c2cccc(Cl)c2)C1
: