Target
RAF proto-oncogene serine/threonine-protein kinase [Y340E,Y341E]
Ligand
BDBM410277
Substrate
Meas. Tech.
Biological Assays
IC50
0.002±n/a nM
Citation
 Aversa, RJBurger, MTDillon, MPDineen, Jr., TAKarki, RRamurthy, SRauniyar, VRobinson, RSarver, PJ Tricyclic compounds and compositions as kinase inhibitors US Patent  US10377770 Publication Date 8/13/2019 
Target
Name:
RAF proto-oncogene serine/threonine-protein kinase [Y340E,Y341E]
Synonyms:
C-RAF RAF RAF1 | RAF1_HUMAN
Type:
Mol. Mass.:
73012.38
Organism:
Homo sapiens (Human)
Description:
P04049[Y340E,Y341E]
Residue:
648
  
Inhibitor
Name:
BDBM410277
Synonyms:
(rac)-N-(3-(6-hydroxy-6-methyl-1,2,4,4a,5,6-hexahydro-[1,4]oxazino[4,3-a]quinolin-9-yl)-4-methylphenyl)-2-(trifluoromethyl)isonicotinamide | US10377770, Example 39
Type:
Small organic molecule
Emp. Form.:
C26H25F3N4O3
Mol. Mass.:
498.4969
SMILES:
Cc1ccc(NC(=O)c2ccnc(c2)C(F)(F)F)cc1-c1cnc2c(c1)N1CCOCC1C[C@@]2(C)O
: