Target
RAF proto-oncogene serine/threonine-protein kinase [Y340E,Y341E]
Ligand
BDBM410281
Substrate
Meas. Tech.
Biological Assays
IC50
0.008±n/a nM
Citation
 Aversa, RJBurger, MTDillon, MPDineen, Jr., TAKarki, RRamurthy, SRauniyar, VRobinson, RSarver, PJ Tricyclic compounds and compositions as kinase inhibitors US Patent  US10377770 Publication Date 8/13/2019 
Target
Name:
RAF proto-oncogene serine/threonine-protein kinase [Y340E,Y341E]
Synonyms:
C-RAF RAF RAF1 | RAF1_HUMAN
Type:
Mol. Mass.:
73012.38
Organism:
Homo sapiens (Human)
Description:
P04049[Y340E,Y341E]
Residue:
648
  
Inhibitor
Name:
BDBM410281
Synonyms:
US10377770, Example 43 | US10377770, Example 44
Type:
Small organic molecule
Emp. Form.:
C26H25F3N4O3
Mol. Mass.:
498.4969
SMILES:
Cc1ncc(NC(=O)c2cccc(c2)C(F)(F)F)cc1-c1cnc2c(c1)N1CCOCC1CC2(C)O
: