Target
RAF proto-oncogene serine/threonine-protein kinase [Y340E,Y341E]
Ligand
BDBM410364
Substrate
Meas. Tech.
Biological Assays
IC50
0.009±n/a nM
Citation
 Aversa, RJBurger, MTDillon, MPDineen, Jr., TAKarki, RRamurthy, SRauniyar, VRobinson, RSarver, PJ Tricyclic compounds and compositions as kinase inhibitors US Patent  US10377770 Publication Date 8/13/2019 
Target
Name:
RAF proto-oncogene serine/threonine-protein kinase [Y340E,Y341E]
Synonyms:
C-RAF RAF RAF1 | RAF1_HUMAN
Type:
Mol. Mass.:
73012.38
Organism:
Homo sapiens (Human)
Description:
P04049[Y340E,Y341E]
Residue:
648
  
Inhibitor
Name:
BDBM410364
Synonyms:
US10377770, Example 124
Type:
Small organic molecule
Emp. Form.:
C26H25F2N5O3
Mol. Mass.:
493.5052
SMILES:
Cc1ccc(NC(=O)c2ccnc(c2)C(C)(F)F)cc1-c1cnc2NC(=O)CC3COCCN3c2c1
: