Target
RAF proto-oncogene serine/threonine-protein kinase [Y340E,Y341E]
Ligand
BDBM410462
Substrate
Meas. Tech.
Biological Assays
IC50
<0.1±n/a nM
Comments
0.000 12/22/2021
Citation
 Aversa, RJBurger, MTDillon, MPDineen, Jr., TAKarki, RRamurthy, SRauniyar, VRobinson, RSarver, PJ Tricyclic compounds and compositions as kinase inhibitors US Patent  US10377770 Publication Date 8/13/2019 
Target
Name:
RAF proto-oncogene serine/threonine-protein kinase [Y340E,Y341E]
Synonyms:
C-RAF RAF RAF1 | RAF1_HUMAN
Type:
Mol. Mass.:
73012.38
Organism:
Homo sapiens (Human)
Description:
P04049[Y340E,Y341E]
Residue:
648
  
Inhibitor
Name:
BDBM410462
Synonyms:
US10377770, Example 284
Type:
Small organic molecule
Emp. Form.:
C28H27F3N4O4
Mol. Mass.:
540.5336
SMILES:
Cc1ccc(NC(=O)c2ccnc(c2)C(F)(F)F)cc1-c1cnc2N(CCO)C(=O)C3CCOCCC3c2c1
: