Target
Nuclear receptor ROR-gamma
Ligand
BDBM410769
Substrate
Meas. Tech.
FRET Assay
IC50
575±n/a nM
Citation
 McCarthy, CWent, NOlsson, RI Indazole and indole derivatives as inhibitors of retinoic acid related orphan receptor gamma (ROR gamma) for the treatment of immune-related diseases US Patent  US10383850 Publication Date 8/20/2019 
Target
Name:
Nuclear receptor ROR-gamma
Synonyms:
NR1F3 Nuclear receptor ROR-gamma (RORC) RAR-related orphan receptor C (RORc) RORG RZRG Retinoid-related orphan receptor-gamma (RORc)
Type:
Enzyme Catalytic Domain
Mol. Mass.:
58218.40
Organism:
Homo sapiens (Human)
Description:
P51449
Residue:
518
  
Inhibitor
Name:
BDBM410769
Synonyms:
US10383850, Compound 7
Type:
Small organic molecule
Emp. Form.:
C24H15ClF3NO3
Mol. Mass.:
457.829
SMILES:
Cc1cccc2c(cn(-c3ccc(cc3)C(O)=O)c12)C(=O)c1c(Cl)cccc1C(F)(F)F
: