Target
Nuclear receptor ROR-gamma
Ligand
BDBM410778
Substrate
Meas. Tech.
FRET Assay
IC50
250±n/a nM
Citation
 McCarthy, CWent, NOlsson, RI Indazole and indole derivatives as inhibitors of retinoic acid related orphan receptor gamma (ROR gamma) for the treatment of immune-related diseases US Patent  US10383850 Publication Date 8/20/2019 
Target
Name:
Nuclear receptor ROR-gamma
Synonyms:
NR1F3 Nuclear receptor ROR-gamma (RORC) RAR-related orphan receptor C (RORc) RORG RZRG Retinoid-related orphan receptor-gamma (RORc)
Type:
Enzyme Catalytic Domain
Mol. Mass.:
58218.40
Organism:
Homo sapiens (Human)
Description:
P51449
Residue:
518
  
Inhibitor
Name:
BDBM410778
Synonyms:
6-[3-(2,6-dichlorobenzoyl)indazol-1-yl]pyridine-3-carboxylic acid | US10383850, Compound 16
Type:
Small organic molecule
Emp. Form.:
C20H11Cl2N3O3
Mol. Mass.:
412.226
SMILES:
OC(=O)c1ccc(nc1)-n1nc(C(=O)c2c(Cl)cccc2Cl)c2ccccc12
: