Target
Fatty-acid amide hydrolase 1
Ligand
BDBM155361
Substrate
Meas. Tech.
Human FAAH 1 Assay
IC50
19.0±n/a nM
Citation
 Roughley, SWalls, SHart, TParsons, RBrough, PGraham, CMacias, A Azetidine derivatives US Patent  US10383871 Publication Date 8/20/2019 
Target
Name:
Fatty-acid amide hydrolase 1
Synonyms:
Anandamide amidohydrolase FAAH FAAH1_HUMAN Fatty-acid amide hydrolase (FAAH) Oleamide hydrolase 1
Type:
Protein
Mol. Mass.:
63071.19
Organism:
Homo sapiens (Human)
Description:
O00519
Residue:
579
  
Inhibitor
Name:
BDBM155361
Synonyms:
US10383871, Example 7 US9006269, 7
Type:
Small organic molecule
Emp. Form.:
C22H23N5O4
Mol. Mass.:
421.4491
SMILES:
COCCOc1cccc(c1)-c1ccc(OC2CN(C2)C(=O)Nc2cccnn2)nc1
: