Target
Period circadian protein homolog 2
Ligand
BDBM50140700
Substrate
Meas. Tech.
High-Throughput Circadian Assay
EC50
510±n/a nM
Citation
 Bersot, RHumphries, P Carbazole-containing sulfonamides as cryptochrome modulators US Patent  US10383880 Publication Date 8/20/2019 
Target
Name:
Period circadian protein homolog 2
Synonyms:
Circadian clock protein PERIOD 2 PER2 Period circadian protein homolog 2 | hPER2
Type:
PROTEIN
Mol. Mass.:
136576.47
Organism:
Homo sapiens (Human)
Description:
ChEMBL_116705
Residue:
1255
  
Inhibitor
Name:
BDBM50140700
Synonyms:
CHEMBL3754797 | US10383880, Example 85
Type:
Small organic molecule
Emp. Form.:
C24H26N2O5S
Mol. Mass.:
454.539
SMILES:
OC(CN(Cc1ccco1)S(=O)(=O)C1CCOC1)Cn1c2ccccc2c2ccccc12
: