Target
Period circadian protein homolog 2
Ligand
BDBM410939
Substrate
Meas. Tech.
High-Throughput Circadian Assay
EC50
2258±n/a nM
Citation
 Bersot, RHumphries, P Carbazole-containing sulfonamides as cryptochrome modulators US Patent  US10383880 Publication Date 8/20/2019 
Target
Name:
Period circadian protein homolog 2
Synonyms:
Circadian clock protein PERIOD 2 PER2 Period circadian protein homolog 2 | hPER2
Type:
PROTEIN
Mol. Mass.:
136576.47
Organism:
Homo sapiens (Human)
Description:
ChEMBL_116705
Residue:
1255
  
Inhibitor
Name:
BDBM410939
Synonyms:
US10383880, Example 151
Type:
Small organic molecule
Emp. Form.:
C20H24F2N2O3S
Mol. Mass.:
410.478
SMILES:
CCCN(CC(C)(O)Cn1c2ccc(F)cc2c2cc(F)ccc12)S(C)(=O)=O
: