Target
Period circadian protein homolog 2
Ligand
BDBM410971
Substrate
Meas. Tech.
High-Throughput Circadian Assay
EC50
53.0±n/a nM
Citation
 Bersot, RHumphries, P Carbazole-containing sulfonamides as cryptochrome modulators US Patent  US10383880 Publication Date 8/20/2019 
Target
Name:
Period circadian protein homolog 2
Synonyms:
Circadian clock protein PERIOD 2 PER2 Period circadian protein homolog 2 | hPER2
Type:
PROTEIN
Mol. Mass.:
136576.47
Organism:
Homo sapiens (Human)
Description:
ChEMBL_116705
Residue:
1255
  
Inhibitor
Name:
BDBM410971
Synonyms:
US10383880, Example 183
Type:
Small organic molecule
Emp. Form.:
C18H17F3N2O3S
Mol. Mass.:
398.399
SMILES:
OC(CN1CCC(F)S1(=O)=O)Cn1c2ccc(F)cc2c2cc(F)ccc12
: