Target
G-protein coupled bile acid receptor 1
Ligand
BDBM411170
Substrate
Meas. Tech.
cAMP Assay
EC50
1783±n/a nM
Citation
 Bissantz, CDehmlow, HErickson, SDKarnachi, PSKim, KMartin, REMattei, PSander, UOPietranico-Cole, SLRichter, HUllmer, C 3-amino-pyridines as GPBAR1 agonists US Patent  US10385022 Publication Date 8/20/2019 
Target
Name:
G-protein coupled bile acid receptor 1
Synonyms:
BG37 GPBAR_HUMAN TGR5 hGPCR19
Type:
G Protein-Coupled Receptor (GPCR)
Mol. Mass.:
35260.02
Organism:
Homo sapiens (Human)
Description:
CHO cells transiently transfected with hTGR5.
Residue:
330
  
Inhibitor
Name:
BDBM411170
Synonyms:
N-[4-(3,6-Dihydro-2H-pyran-4-yl)-pyridin-3-yl]-N-methyl-3,5-bis-trifluoromethyl-benzamide | US10385022, Example 166
Type:
Small organic molecule
Emp. Form.:
C20H16F6N2O2
Mol. Mass.:
430.3437
SMILES:
CN(C(=O)c1cc(cc(c1)C(F)(F)F)C(F)(F)F)c1cnccc1C1=CCOCC1
: