Target
Histone deacetylase 1
Ligand
BDBM411328
Substrate
Meas. Tech.
Enzyme Assays
IC50
<10±n/a nM
Citation
 van Duzer, JHMazitschek, R Substituted piperazines as selective HDAC1,2 inhibitors US Patent  US10385031 Publication Date 8/20/2019 
Target
Name:
Histone deacetylase 1
Synonyms:
Cereblon/Histone deacetylase 1 HDAC1 Histone deacetylase 1 (HDAC1) RPD3L1
Type:
Enzyme
Mol. Mass.:
55090.27
Organism:
Homo sapiens (Human)
Description:
Q13547
Residue:
482
  
Inhibitor
Name:
BDBM411328
Synonyms:
US10385031, Compound 034 US11542242, Compound 034
Type:
Small organic molecule
Emp. Form.:
C18H19N5O2S
Mol. Mass.:
369.441
SMILES:
Nc1ccc(cc1NC(=O)c1cnc(s1)N1CCNCC1)-c1ccco1
: