Target
Histone deacetylase 1
Ligand
BDBM411377
Substrate
Meas. Tech.
Enzyme Assays
IC50
<10±n/a nM
Citation
 van Duzer, JHMazitschek, R Substituted piperazines as selective HDAC1,2 inhibitors US Patent  US10385031 Publication Date 8/20/2019 
Target
Name:
Histone deacetylase 1
Synonyms:
Cereblon/Histone deacetylase 1 HDAC1 Histone deacetylase 1 (HDAC1) RPD3L1
Type:
Enzyme
Mol. Mass.:
55090.27
Organism:
Homo sapiens (Human)
Description:
Q13547
Residue:
482
  
Inhibitor
Name:
BDBM411377
Synonyms:
US10385031, Compound 083 US11542242, Compound 083
Type:
Small organic molecule
Emp. Form.:
C21H23N5O2
Mol. Mass.:
377.4396
SMILES:
CN1CCN(CC1)c1ccc(nc1)C(=O)Nc1cc(ccc1N)-c1ccoc1
: