Target
Non-receptor tyrosine-protein kinase TYK2
Ligand
BDBM411422
Substrate
Meas. Tech.
Enzyme Assay
IC50
18.0±n/a nM
Citation
 Watanabe, TTakahashi, KHayashi, KNakamura, TMinami, MKurihara, KYamamoto, ANishimura, TUni, MKamiyama, TIwamoto, S Tricyclic compound and JAK inhibitor US Patent  US10385052 Publication Date 8/20/2019 
Target
Name:
Non-receptor tyrosine-protein kinase TYK2
Synonyms:
Non-receptor tyrosine-protein kinase TYK2 (TYK2) TYK2_HUMAN | Tyrosine-protein kinase TYK2
Type:
Protein
Mol. Mass.:
133666.03
Organism:
Homo sapiens (Human)
Description:
P29597
Residue:
1187
  
Inhibitor
Name:
BDBM411422
Synonyms:
US10385052, Example 3
Type:
Small organic molecule
Emp. Form.:
C21H24F3N5O
Mol. Mass.:
419.4434
SMILES:
FC(F)(F)[C@@H](CC#N)NCC1CCC(CC1)N1C=CC(=O)C2C=Nc3[nH]ccc3C12
: