Target
Calcium/calmodulin-dependent protein kinase type II subunit alpha
Ligand
BDBM6827
Substrate
Autocamtide-2
Meas. Tech.
CDK Kinase Inhibition Assay
Temperature
298.15±n/a K
IC50
6120±n/a nM
Comments
extracted
Citation
 Engler, TAFurness, KMalhotra, SSanchez-Martinez, CShih, CXie, WZhu, GZhou, XConner, SFaul, MMSullivan, KAKolis, SPBrooks, HBPatel, BSchultz, RMDeHahn, TBKirmani, KSpencer, CDWatkins, SAConsidine, ELDempsey, JAOgg, CAStamm, NBAnderson, BDCampbell, RMVasudevan, VLytle, ML Novel, potent and selective cyclin D1/CDK4 inhibitors: indolo[6,7-a]pyrrolo[3,4-c]carbazoles. Bioorg Med Chem Lett 13:2261-7 (2003)  
Target
Name:
Calcium/calmodulin-dependent protein kinase type II subunit alpha
Synonyms:
CaM Kinase II Camk2a calcium/calmodulin-dependent protein kinase II alpha subunit
Type:
Enzyme Mixture
Mol. Mass.:
54120.65
Organism:
Rattus norvegicus (rat)
Description:
Consists of subunits of M.W. 50,000 and 58,000-60,000 in a 3:1 ratio.
Residue:
478
  
Inhibitor
Name:
BDBM6827
Synonyms:
3-{2-[(2S)-2-(hydroxymethyl)pyrrolidin-1-yl]ethyl}-6-methoxy-18-methyl-3,13,18-triazahexacyclo[14.7.0.0^{2,10}.0^{4,9}.0^{11,15}.0^{17,21}]tricosa-1(16),2(10),4(9),5,7,11(15),17(21),19,22-nonaene-12,14-dione | indolocarbazole deriv. 11e
Type:
Small organic molecule
Emp. Form.:
C29H28N4O4
Mol. Mass.:
496.557
SMILES:
COc1ccc2c(c1)n(CCN1CCC[C@H]1CO)c1c2c2C(=O)NC(=O)c2c2c3n(C)ccc3ccc12
:
Substrate
Name:
Autocamtide-2
Synonyms:
Type:
Peptide
Mol. Mass.:
3697.73
Organism:
Description:
Residue:
36