Target
Diacylglycerol O-acyltransferase 1
Ligand
BDBM321154
Substrate
Meas. Tech.
In Vitro Assay
IC50
16.3±n/a nM
Citation
 Cheung, MTangirala, R Compounds as diacylglycerol acyltransferase inhibitors US Patent  US10385066 Publication Date 8/20/2019 
Target
Name:
Diacylglycerol O-acyltransferase 1
Synonyms:
ACAT-related gene product 1 Acyl coA-diacylglycerol acyl transferase 1 (DGAT1) DGAT1 Diacylglycerol Acyltransferase (DGAT1) Diacylglycerol O-acyltransferase 1 (DGAT1) | Diglyceride acyltransferase
Type:
Protein
Mol. Mass.:
55297.82
Organism:
Homo sapiens (Human)
Description:
O75907
Residue:
488
  
Inhibitor
Name:
BDBM321154
Synonyms:
US10174049, Example 21 US9796729, 21
Type:
Small organic molecule
Emp. Form.:
C18H15N7O3
Mol. Mass.:
377.3568
SMILES:
Cc1nnc(o1)-n1ccc2cc(ccc12)N1CCOc2ncnc(N)c2C1=O
: