Target
Baculoviral IAP repeat-containing protein 2 [174-256]
Ligand
BDBM298407
Substrate
Meas. Tech.
Enzyme Inhibition
IC50
25.0±n/a nM
Citation
 Baker, TMFyfe, MCJones, GThom, SM Kinase inhibitors US Patent  US10392346 Publication Date 8/27/2019 
Target
Name:
Baculoviral IAP repeat-containing protein 2 [174-256]
Synonyms:
API1 BIRC2_HUMAN MIHB | RNF48
Type:
Enzyme Catalytic Domain
Mol. Mass.:
9527.07
Organism:
Homo sapiens (Human)
Description:
Q13490[174-256]
Residue:
83
  
Inhibitor
Name:
BDBM298407
Synonyms:
4-[[4-[[4-[[5-tert-butyl-3-(methanesulfonamido)-2-methoxy-phenyl]carbamoylamino]-1-naphthyl]oxy]-2-pyridyl]amino]-N-[2-(4-hydroxy-1-piperidyl)ethyl]-2-methoxy-benzamide US10392346, Example 17(m) US9751837, Example 17(m)
Type:
Small organic molecule
Emp. Form.:
C43H51N7O8S
Mol. Mass.:
825.972
SMILES:
COc1cc(Nc2cc(Oc3ccc(NC(=O)Nc4cc(cc(NS(C)(=O)=O)c4OC)C(C)(C)C)c4ccccc34)ccn2)ccc1C(=O)NCCN1CCC(O)CC1
: