Target
Baculoviral IAP repeat-containing protein 2 [174-256]
Ligand
BDBM298426
Substrate
Meas. Tech.
Enzyme Inhibition
IC50
5.00±n/a nM
Citation
 Baker, TMFyfe, MCJones, GThom, SM Kinase inhibitors US Patent  US10392346 Publication Date 8/27/2019 
Target
Name:
Baculoviral IAP repeat-containing protein 2 [174-256]
Synonyms:
API1 BIRC2_HUMAN MIHB | RNF48
Type:
Enzyme Catalytic Domain
Mol. Mass.:
9527.07
Organism:
Homo sapiens (Human)
Description:
Q13490[174-256]
Residue:
83
  
Inhibitor
Name:
BDBM298426
Synonyms:
4-[[4-[[4-[[5-tert-butyl-3-(methanesulfonamido)-2-methoxy-phenyl]carbamoylamino]-1-naphthyl]oxy]-2-pyridyl]amino]-2-methoxy-N-methyl-N-(3-morpholinopropyl)benzamide US10392346, Example 17(af) US9751837, Example 17(af)
Type:
Small organic molecule
Emp. Form.:
C44H53N7O8S
Mol. Mass.:
839.999
SMILES:
COc1cc(Nc2cc(Oc3ccc(NC(=O)Nc4cc(cc(NS(C)(=O)=O)c4OC)C(C)(C)C)c4ccccc34)ccn2)ccc1C(=O)N(C)CCCN1CCOCC1
: