Target
ATR-interacting protein/Serine/threonine-protein kinase ATR
Ligand
BDBM411501
Substrate
Meas. Tech.
Enzymatic Assay
IC50
0.900±n/a nM
Citation
 Di Francesco, MEJones, PCarroll, CLCross, JBRamaswamy, SKJohnson, MGLively, SLapointe, D Heterocyclic inhibitors of ATR kinase US Patent  US10392376 Publication Date 8/27/2019 
Target
Name:
ATR-interacting protein/Serine/threonine-protein kinase ATR
Synonyms:
ATR/ATRIP
Type:
Enzyme
Mol. Mass.:
Description:
Components:
This complex has 2 components.
Component 1
Name:
Serine/threonine-protein kinase ATR
Synonyms:
ATR Ataxia telangiectasia and Rad3-related protein (ATR) FRP1 | Serine-protein kinase ATR
Type:
Protein
Mol. Mass.:
301404.58
Organism:
Homo sapiens (Human)
Description:
Q13535
Residue:
2644
  
Component 2
Name:
ATR-interacting protein
Synonyms:
AGS1 ATR-interacting protein (ATRIP) ATRIP_HUMAN
Type:
Enzyme Catalytic Domain
Mol. Mass.:
85833.30
Organism:
Homo sapiens (Human)
Description:
Q8WXE1
Residue:
791
  
Inhibitor
Name:
BDBM411501
Synonyms:
US10392376, Example 52 US11434233, Example 52
Type:
Small organic molecule
Emp. Form.:
C19H24N6O3S
Mol. Mass.:
416.497
SMILES:
C[C@@H]1COCCN1c1cc(N=S(C)(C)=O)nc(n1)-n1c(CO)nc2ccccc12
: