Target
ATR-interacting protein/Serine/threonine-protein kinase ATR
Ligand
BDBM411536
Substrate
Meas. Tech.
Enzymatic Assay
IC50
316±n/a nM
Citation
 Di Francesco, MEJones, PCarroll, CLCross, JBRamaswamy, SKJohnson, MGLively, SLapointe, D Heterocyclic inhibitors of ATR kinase US Patent  US10392376 Publication Date 8/27/2019 
Target
Name:
ATR-interacting protein/Serine/threonine-protein kinase ATR
Synonyms:
ATR/ATRIP
Type:
Enzyme
Mol. Mass.:
Description:
Components:
This complex has 2 components.
Component 1
Name:
Serine/threonine-protein kinase ATR
Synonyms:
ATR Ataxia telangiectasia and Rad3-related protein (ATR) FRP1 | Serine-protein kinase ATR
Type:
Protein
Mol. Mass.:
301404.58
Organism:
Homo sapiens (Human)
Description:
Q13535
Residue:
2644
  
Component 2
Name:
ATR-interacting protein
Synonyms:
AGS1 ATR-interacting protein (ATRIP) ATRIP_HUMAN
Type:
Enzyme Catalytic Domain
Mol. Mass.:
85833.30
Organism:
Homo sapiens (Human)
Description:
Q8WXE1
Residue:
791
  
Inhibitor
Name:
BDBM411536
Synonyms:
(R)-dimethyl((6-(3- methylmorpholino)-2-(2- (2,2,2-trifluoroethoxy)- 1H-pyrrolo[2,3- b]pyridin-4-yl)pyrimidin- 4-yl)imino)-lambda6-sulfanone US10800769, Example 87 | US11434233, Example 87
Type:
Small organic molecule
Emp. Form.:
C20H23F3N6O3S
Mol. Mass.:
484.495
SMILES:
C[C@@H]1COCCN1c1cc(N=S(C)(C)=O)nc(n1)-c1ccnc2[nH]c(OCC(F)(F)F)cc12
: