Target
ATR-interacting protein/Serine/threonine-protein kinase ATR
Ligand
BDBM411569
Substrate
Meas. Tech.
Enzymatic Assay
IC50
26.0±n/a nM
Citation
 Di Francesco, MEJones, PCarroll, CLCross, JBRamaswamy, SKJohnson, MGLively, SLapointe, D Heterocyclic inhibitors of ATR kinase US Patent  US10392376 Publication Date 8/27/2019 
Target
Name:
ATR-interacting protein/Serine/threonine-protein kinase ATR
Synonyms:
ATR/ATRIP
Type:
Enzyme
Mol. Mass.:
Description:
Components:
This complex has 2 components.
Component 1
Name:
Serine/threonine-protein kinase ATR
Synonyms:
ATR Ataxia telangiectasia and Rad3-related protein (ATR) FRP1 | Serine-protein kinase ATR
Type:
Protein
Mol. Mass.:
301404.58
Organism:
Homo sapiens (Human)
Description:
Q13535
Residue:
2644
  
Component 2
Name:
ATR-interacting protein
Synonyms:
AGS1 ATR-interacting protein (ATRIP) ATRIP_HUMAN
Type:
Enzyme Catalytic Domain
Mol. Mass.:
85833.30
Organism:
Homo sapiens (Human)
Description:
Q8WXE1
Residue:
791
  
Inhibitor
Name:
BDBM411569
Synonyms:
Methyl(1-methyl-1H- pyrazol-4-yl)((6-((R)-3- methylmorpholino)-2- (1H-pyrrolo[2,3-b]- pyridin-4-yl)pyrimidin-4- yl)imino)-lambda6-sulfanone US10800769, Example 120
Type:
Small organic molecule
Emp. Form.:
C21H24N8O2S
Mol. Mass.:
452.533
SMILES:
C[C@@H]1COCCN1c1cc(N=S(C)(=O)c2cnn(C)c2)nc(n1)-c1ccnc2[nH]ccc12
: