Target
Serine/threonine-protein kinase ATR
Ligand
BDBM411749
Substrate
Meas. Tech.
Inhibition Assay
Ki
<10±n/a nM
Citation
 Ahmad, NBoyall, DCharrier, JDavis, CDavis, RDurrant, SEtxebarria I Jardi, GFraysse, DJimenez, JKay, DKnegtel, RMiddleton, DO Donnell, MPanesar, MPierard, FPinder, JShaw, DStorck, PStudley, JTwin, H Compounds useful as inhibitors of ATR kinase US Patent  US10392391 Publication Date 8/27/2019 
Target
Name:
Serine/threonine-protein kinase ATR
Synonyms:
ATR Ataxia telangiectasia and Rad3-related protein (ATR) FRP1 | Serine-protein kinase ATR
Type:
Protein
Mol. Mass.:
301404.58
Organism:
Homo sapiens (Human)
Description:
Q13535
Residue:
2644
  
Inhibitor
Name:
BDBM411749
Synonyms:
US10392391, Compound I-N-182 US10787452, Compound I-N-186 US11370798, Cmpd. # I-N-186 | US20230271963, Compound I-N-186
Type:
Small organic molecule
Emp. Form.:
C19H18F2N8O2
Mol. Mass.:
428.3954
SMILES:
Nc1nn2cc(F)cnc2c1C(=O)Nc1cncc(F)c1N1CCN2[C@H](CCC2=O)C1
: