Target
Serine/threonine-protein kinase ATR
Ligand
BDBM411989
Substrate
Meas. Tech.
Inhibition Assay
Ki
<10±n/a nM
Citation
 Ahmad, NBoyall, DCharrier, JDavis, CDavis, RDurrant, SEtxebarria I Jardi, GFraysse, DJimenez, JKay, DKnegtel, RMiddleton, DO Donnell, MPanesar, MPierard, FPinder, JShaw, DStorck, PStudley, JTwin, H Compounds useful as inhibitors of ATR kinase US Patent  US10392391 Publication Date 8/27/2019 
Target
Name:
Serine/threonine-protein kinase ATR
Synonyms:
ATR Ataxia telangiectasia and Rad3-related protein (ATR) FRP1 | Serine-protein kinase ATR
Type:
Protein
Mol. Mass.:
301404.58
Organism:
Homo sapiens (Human)
Description:
Q13535
Residue:
2644
  
Inhibitor
Name:
BDBM411989
Synonyms:
US10392391, Compound I-C-43 US11117900, Compound I-C-43 US20230271963, Compound I-C-43
Type:
Small organic molecule
Emp. Form.:
C24H22F2N8O2
Mol. Mass.:
492.4807
SMILES:
CN1CCN(CC1)C(=O)c1ccc(cc1)-c1c(F)cncc1NC(=O)c1c(N)nn2cc(F)cnc12
: