Target
Serine/threonine-protein kinase pim-1
Ligand
BDBM242377
Substrate
Meas. Tech.
Kinase Inhibition Assay
IC50
241±n/a nM
Citation
 Xu, YBrenning, BGKultgen, SGLiu, XSaunders, MDHo, K Substituted imidazo[1,2-B]pyridazines as protein kinase inhibitors US Patent  US10392392 Publication Date 8/27/2019 
Target
Name:
Serine/threonine-protein kinase pim-1
Synonyms:
PIM-1 Kinase PIM1_HUMAN Serine/threonine-protein kinase (PIM1) Serine/threonine-protein kinase PIM1 | Serine/threonine-protein kinase pim-1 (PIM1)
Type:
Protein
Mol. Mass.:
35681.82
Organism:
Homo sapiens (Human)
Description:
P11309
Residue:
313
  
Inhibitor
Name:
BDBM242377
Synonyms:
US10047093, 8-34 US10875864, EX. 8-34 | US9416132, 8-34
Type:
Small organic molecule
Emp. Form.:
C19H19F3N4O2S
Mol. Mass.:
424.44
SMILES:
FC(F)(F)c1cccc(c1)-c1cnc2ccc(NCC3CCS(=O)(=O)CC3)nn12
: