Target
Serine/threonine-protein kinase pim-1
Ligand
BDBM242383
Substrate
Meas. Tech.
Kinase Inhibition Assay
IC50
226±n/a nM
Citation
 Xu, YBrenning, BGKultgen, SGLiu, XSaunders, MDHo, K Substituted imidazo[1,2-B]pyridazines as protein kinase inhibitors US Patent  US10392392 Publication Date 8/27/2019 
Target
Name:
Serine/threonine-protein kinase pim-1
Synonyms:
PIM-1 Kinase PIM1_HUMAN Serine/threonine-protein kinase (PIM1) Serine/threonine-protein kinase PIM1 | Serine/threonine-protein kinase pim-1 (PIM1)
Type:
Protein
Mol. Mass.:
35681.82
Organism:
Homo sapiens (Human)
Description:
P11309
Residue:
313
  
Inhibitor
Name:
BDBM242383
Synonyms:
US10047093, 8-41 US10875864, EX. 8-41 | US9416132, 8-41
Type:
Small organic molecule
Emp. Form.:
C18H18F3N3O3
Mol. Mass.:
381.349
SMILES:
CC(C)(O)CCOc1ccc2ncc(-c3cccc(OC(F)(F)F)c3)n2n1
: