Target
Serine/threonine-protein kinase pim-1
Ligand
BDBM50043697
Substrate
Meas. Tech.
Kinase Inhibition Assay
IC50
23.0±n/a nM
Citation
 Xu, YBrenning, BGKultgen, SGLiu, XSaunders, MDHo, K Substituted imidazo[1,2-B]pyridazines as protein kinase inhibitors US Patent  US10392392 Publication Date 8/27/2019 
Target
Name:
Serine/threonine-protein kinase pim-1
Synonyms:
PIM-1 Kinase PIM1_HUMAN Serine/threonine-protein kinase (PIM1) Serine/threonine-protein kinase PIM1 | Serine/threonine-protein kinase pim-1 (PIM1)
Type:
Protein
Mol. Mass.:
35681.82
Organism:
Homo sapiens (Human)
Description:
P11309
Residue:
313
  
Inhibitor
Name:
BDBM50043697
Synonyms:
CHEMBL3355987 US10392392, Example 8-63 US9416132, 8-63
Type:
Small organic molecule
Emp. Form.:
C21H25ClN4O
Mol. Mass.:
384.902
SMILES:
CC(C)(O)[C@H]1CC[C@@H](CC1)Nc1ccn2ncc(-c3cccc(Cl)c3)c2n1
: