Target
Serine/threonine-protein kinase pim-1
Ligand
BDBM242400
Substrate
Meas. Tech.
Kinase Inhibition Assay
IC50
89.0±n/a nM
Citation
 Xu, YBrenning, BGKultgen, SGLiu, XSaunders, MDHo, K Substituted imidazo[1,2-B]pyridazines as protein kinase inhibitors US Patent  US10392392 Publication Date 8/27/2019 
Target
Name:
Serine/threonine-protein kinase pim-1
Synonyms:
PIM-1 Kinase PIM1_HUMAN Serine/threonine-protein kinase (PIM1) Serine/threonine-protein kinase PIM1 | Serine/threonine-protein kinase pim-1 (PIM1)
Type:
Protein
Mol. Mass.:
35681.82
Organism:
Homo sapiens (Human)
Description:
P11309
Residue:
313
  
Inhibitor
Name:
BDBM242400
Synonyms:
US10047093, 8-83 US10875864, EX. 8-83 | US9416132, 8-83
Type:
Small organic molecule
Emp. Form.:
C19H20ClN5O
Mol. Mass.:
369.848
SMILES:
Clc1cccc(c1)-c1cnc2ccc(N[C@H]3CC[C@@H](CC3)NC=O)nn12
: