Target
Serine/threonine-protein kinase pim-1
Ligand
BDBM242412
Substrate
Meas. Tech.
Kinase Inhibition Assay
IC50
168±n/a nM
Citation
 Xu, YBrenning, BGKultgen, SGLiu, XSaunders, MDHo, K Substituted imidazo[1,2-B]pyridazines as protein kinase inhibitors US Patent  US10392392 Publication Date 8/27/2019 
Target
Name:
Serine/threonine-protein kinase pim-1
Synonyms:
PIM-1 Kinase PIM1_HUMAN Serine/threonine-protein kinase (PIM1) Serine/threonine-protein kinase PIM1 | Serine/threonine-protein kinase pim-1 (PIM1)
Type:
Protein
Mol. Mass.:
35681.82
Organism:
Homo sapiens (Human)
Description:
P11309
Residue:
313
  
Inhibitor
Name:
BDBM242412
Synonyms:
US10047093, 8-97 US10875864, EX. 8-97 | US9416132, 8-97
Type:
Small organic molecule
Emp. Form.:
C18H17ClN4O
Mol. Mass.:
340.807
SMILES:
Clc1cccc(c1)-c1cnn2ccc(NC3CCC(=O)CC3)nc12
: