Target
Programmed cell death 1 ligand 1
Ligand
BDBM412157
Substrate
Meas. Tech.
Enzyme-Linked Immunosorbent Assay - ELISA
IC50
<100±n/a nM
Citation
 Malathong, VMcMahon, JMcMurtrie, DJPunna, SRoth, HSSingh, RZhang, P Macrocyclic immunomodulators US Patent  US10392405 Publication Date 8/27/2019 
Target
Name:
Programmed cell death 1 ligand 1
Synonyms:
B7 homolog 1 B7H1 CD274 PD-L1 PDCD1 ligand 1 PDCD1LG1 Programmed cell death 1 ligand 1 | Programmed death ligand 1
Type:
PROTEIN
Mol. Mass.:
33278.49
Organism:
Homo sapiens (Human)
Description:
ChEMBL_109807
Residue:
290
  
Inhibitor
Name:
BDBM412157
Synonyms:
US10392405, Compound Id 1.021 US11691985, Compound 1.021
Type:
Small organic molecule
Emp. Form.:
C45H50ClFN4O6
Mol. Mass.:
797.353
SMILES:
Cc1c(COc2cc3OCc4cc(cc(c4)C(=O)NCCCC[C@H](NCc3cc2Cl)C(O)=O)C#N)cccc1-c1cccc(OCCCN2CCC(F)CC2)c1C
: