Target
E3 ubiquitin-protein ligase XIAP [241-356]
Ligand
BDBM412171
Substrate
Meas. Tech.
TR-FRET Assays for XIAP BIR3
IC50
2.00±n/a nM
Citation
 Flohr, AGalley, GNorcross, RZorn, N Dimeric compounds US Patent  US10398702 Publication Date 9/3/2019 
Target
Name:
E3 ubiquitin-protein ligase XIAP [241-356]
Synonyms:
API3 BIR3 domain IAP3 XIAP Bir3 amino acids 241-356 of XIAP
Type:
Enzyme Catalytic Domain
Mol. Mass.:
14548.06
Organism:
Homo sapiens (Human)
Description:
P98170[241-356]
Residue:
125
  
Inhibitor
Name:
BDBM412171
Synonyms:
(3S)-2-[(2S)-3,3-dimethyl- 2-[[(2S)-2- (methylamino)propanoyl] amino]butanoyl]-7-[[2- [[(3S)-6-[(4- fluorophenyl)methyl]-3- methyl-1-[2-[(2R,5R)-5- methyl-2-[[(3R)-3- methylmorpholin-4- yl]methyl]piperazin-1- yl]acetyl]-2H-indole-3- carbonyl]amino]acetyl] amino]-N-[(1R)-1,2,3,4- tetrahydronaphthalen-1-yl]- 3,4-dihydro-1H- isoquinoline-3- carboxamide;trihydrochloride | US10398702, Example 10
Type:
Small organic molecule
Emp. Form.:
C62H81FN10O7
Mol. Mass.:
1097.3677
SMILES:
CN[C@@H](C)C(=O)N[C@H](C(=O)N1Cc2cc(NC(=O)CNC(=O)[C@]3(C)CN(C(=O)CN4C[C@@H](C)NC[C@@H]4CN4CCOC[C@H]4C)c4cc(Cc5ccc(F)cc5)ccc34)ccc2C[C@H]1C(=O)N[C@@H]1CCCc2ccccc12)C(C)(C)C
: