Target
Baculoviral IAP repeat-containing protein 2 [174-256]
Ligand
BDBM412181
Substrate
Meas. Tech.
TR-FRET Assays for cIAP BIR2
IC50
110±n/a nM
Citation
 Flohr, AGalley, GNorcross, RZorn, N Dimeric compounds US Patent  US10398702 Publication Date 9/3/2019 
Target
Name:
Baculoviral IAP repeat-containing protein 2 [174-256]
Synonyms:
API1 BIRC2_HUMAN MIHB | RNF48
Type:
Enzyme Catalytic Domain
Mol. Mass.:
9527.07
Organism:
Homo sapiens (Human)
Description:
Q13490[174-256]
Residue:
83
  
Inhibitor
Name:
BDBM412181
Synonyms:
(S)-N-(2-(((S)-3-((2,6- difluorophenyl)carbamoyl)- 2-((2S,3R)-3-methoxy-2- ((S)-2- (methylamino)propanamido) butanoyl)isoindolin-5- yl)amino)-2-oxoethyl)-6-(4- fluorobenzyl)-3-methyl-1-(2- ((2R,5R)-5-methyl-2-(((R)- 3-methylmorpholino)methyl) piperazin-1- yl)acetyl)indoline-3- carboxamide trihydrochloride | US10398702, Example 20
Type:
Small organic molecule
Emp. Form.:
C56H69F3N10O8
Mol. Mass.:
1067.2045
SMILES:
CN[C@@H](C)C(=O)N[C@@H]([C@@H](C)OC)C(=O)N1Cc2ccc(NC(=O)CNC(=O)[C@]3(C)CN(C(=O)CN4C[C@@H](C)NC[C@@H]4CN4CCOC[C@H]4C)c4cc(Cc5ccc(F)cc5)ccc34)cc2[C@H]1C(=O)Nc1c(F)cccc1F
: