Target
Uracil-DNA glycosylase
Ligand
BDBM33154
Substrate
Meas. Tech.
Processive DNA synthesis assay
pH
7.5±n/a
EC50
35600±n/a nM
Comments
extracted
Citation
 Ricciardi, RPReitz, ABParker, MHBaugh, SDNuth, MGuan, H Antivirals against molluscum contagiosum virus US Patent  US10112895 Publication Date 10/30/2018 
Target
Name:
Uracil-DNA glycosylase
Synonyms:
OPG116 UNG | UNG_VACCW
Type:
PROTEIN
Mol. Mass.:
25071.48
Organism:
Vaccinia virus (strain Western Reserve) (VACV) (Vaccinia virus (strainWR))
Description:
ChEMBL_747132
Residue:
218
  
Inhibitor
Name:
BDBM33154
Synonyms:
4-[(2-benzoxybenzyl)amino]phenol 4-{[2-(benzyloxy)benzyl]amino}phenol SMR000231540 cid_833990
Type:
Small organic molecule
Emp. Form.:
C20H19NO2
Mol. Mass.:
305.3704
SMILES:
Oc1ccc(NCc2ccccc2OCc2ccccc2)cc1
: