Target
Uracil-DNA glycosylase
Ligand
BDBM294519
Substrate
Meas. Tech.
Processive DNA synthesis assay
pH
7.5±n/a
EC50
17700±n/a nM
Comments
extracted
Citation
 Ricciardi, RPReitz, ABParker, MHBaugh, SDNuth, MGuan, H Antivirals against molluscum contagiosum virus US Patent  US10112895 Publication Date 10/30/2018 
Target
Name:
Uracil-DNA glycosylase
Synonyms:
OPG116 UNG | UNG_VACCW
Type:
PROTEIN
Mol. Mass.:
25071.48
Organism:
Vaccinia virus (strain Western Reserve) (VACV) (Vaccinia virus (strainWR))
Description:
ChEMBL_747132
Residue:
218
  
Inhibitor
Name:
BDBM294519
Synonyms:
2-[[2-[(3- nitrophenyl)methoxy]phenyl] methylamino]phenol | US10112895, Compound 11
Type:
Small organic molecule
Emp. Form.:
C20H18N2O4
Mol. Mass.:
350.3679
SMILES:
Oc1ccccc1NCc1ccccc1OCc1cccc(c1)[N+]([O-])=O
: