Target
RNA-directed RNA polymerase L
Ligand
BDBM412214
Substrate
Meas. Tech.
RSV assay
EC50
>800±n/a nM
Citation
 Shook, BCKim, IJYu, JBlaisdell, TPPanarese, JOr, YS Heteroaryldiazepine derivatives as RSV inhibitors US Patent  US10398706 Publication Date 9/3/2019 
Target
Name:
RNA-directed RNA polymerase L
Synonyms:
Large structural protein | Protein L
Type:
Enzyme Catalytic Domain
Mol. Mass.:
250571.66
Organism:
Respiratory syncytial virus type A
Description:
Residue:
2165
  
Inhibitor
Name:
BDBM412214
Synonyms:
US10398706, Example 3
Type:
Small organic molecule
Emp. Form.:
C22H15FN6O2
Mol. Mass.:
414.3919
SMILES:
Fc1ccc(cc1)-c1nnc(NC2N=C(c3ccccc3)c3ccncc3NC2=O)o1
: