Target
Estrogen receptor
Ligand
BDBM412224
Substrate
Meas. Tech.
Biological Evaluation
EC50
15.6±n/a nM
Citation
 Liang, JOrtwine, DFWang, XZbieg, J Tetrahydronaphthalene estrogen receptor modulators and uses thereof US Patent  US10399939 Publication Date 9/3/2019 
Target
Name:
Estrogen receptor
Synonyms:
ER ESR ESR1_HUMAN Estrogen receptor Estrogen receptor (ER-alpha) Estrogen receptor alpha (ER) Nuclear receptor subfamily 3 group A member 1
Type:
Protein
Mol. Mass.:
66230.44
Organism:
Homo sapiens (Human)
Description:
P03372
Residue:
595
  
Inhibitor
Name:
BDBM412224
Synonyms:
(1R,2R)-1-[2,6- difluoro-4-[2-[3- (fluoromethyl)azetidin- 1-yl]ethoxy]phenyl]- 2-phenyl-tetralin-6-ol | US10399939, Example 104
Type:
Small organic molecule
Emp. Form.:
C28H28F3NO2
Mol. Mass.:
467.5226
SMILES:
Oc1ccc2[C@@H]([C@@H](CCc2c1)c1ccccc1)c1c(F)cc(OCCN2CC(CF)C2)cc1F
: