Target
Estrogen receptor
Ligand
BDBM412227
Substrate
Meas. Tech.
Biological Evaluation
EC50
16.4±n/a nM
Citation
 Liang, JOrtwine, DFWang, XZbieg, J Tetrahydronaphthalene estrogen receptor modulators and uses thereof US Patent  US10399939 Publication Date 9/3/2019 
Target
Name:
Estrogen receptor
Synonyms:
ER ESR ESR1_HUMAN Estrogen receptor Estrogen receptor (ER-alpha) Estrogen receptor alpha (ER) Nuclear receptor subfamily 3 group A member 1
Type:
Protein
Mol. Mass.:
66230.44
Organism:
Homo sapiens (Human)
Description:
P03372
Residue:
595
  
Inhibitor
Name:
BDBM412227
Synonyms:
(5R,6R)-5-(4-(2-(3- (fluoromethyl)azetidin- 1-yl)ethoxy)phenyl)- 6-(tetrahydro-2H- pyran-4-yl)-5,6,7,8- tetrahydronaphthalen- 2-ol | US10399939, Example 107
Type:
Small organic molecule
Emp. Form.:
C27H34FNO3
Mol. Mass.:
439.5622
SMILES:
Oc1ccc2[C@H]([C@H](CCc2c1)C1CCOCC1)c1ccc(OCCN2CC(CF)C2)cc1
: