Target
High affinity nerve growth factor receptor
Ligand
BDBM412333
Substrate
Meas. Tech.
Evaluation of Binding Activity for Human TrkA Protein
IC50
525±n/a nM
Citation
 Saitoh, FNagasue, H Tetrahydronaphthyl urea derivative US Patent  US10399945 Publication Date 9/3/2019 
Target
Name:
High affinity nerve growth factor receptor
Synonyms:
2.7.10.1 NTRK1 NTRK1_HUMAN Neurotrophic tyrosine kinase receptor type 1 Synonyms=MTC TRK1-transforming tyrosine kinase protein TRKA GN Tropomyosin alpha-3 chain/High affinity nerve growth factor receptor Tropomyosin-related kinase A (TrkA) Tyrosine kinase receptor (Trk) Tyrosine kinase receptor A (Trk A) Tyrosine kinase receptor A (TrkA) p140-TrkA
Type:
Mol. Mass.:
87498.18
Organism:
Homo sapiens (Human)
Description:
P04629
Residue:
796
  
Inhibitor
Name:
BDBM412333
Synonyms:
US10399945, Example 61a
Type:
Small organic molecule
Emp. Form.:
C28H31F2N5O4
Mol. Mass.:
539.5736
SMILES:
Cc1cc(NC(=O)N[C@@H]2[C@H](O)CC(C)(C)c3cc(F)c(F)cc23)c(nc1-c1cnc(O)nc1)C1CCOCC1
: