Target
Isocitrate dehydrogenase [NADP] cytoplasmic [R132H]
Ligand
BDBM412517
Substrate
Meas. Tech.
R132H IDH1 Enzymatic Assay
IC50
25.4±n/a nM
Citation
 Witter, DJBiftu, TBiju, PBogen, SLHong, QHuang, CHuang, XLi, BPark, MKSloman, DL Tricyclic compounds as inhibitors of mutant IDH enzymes US Patent  US10399972 Publication Date 9/3/2019 
Target
Name:
Isocitrate dehydrogenase [NADP] cytoplasmic [R132H]
Synonyms:
Cytosolic NADP-isocitrate dehydrogenase (IDH1)(R132H) IDH1 R132H IDHC_HUMAN Isocitrate dehydrogenase 1 mutant (R132H) Isocitrate dehydrogenase [NADP] cytoplasmic (IDH1)(R132H) PICD
Type:
Protein
Mol. Mass.:
46641.74
Organism:
Homo sapiens (Human)
Description:
Human IDH1 R132H (SEQ ID No. 2 in patent). First three are removed. Google patent parsed wrong.
Residue:
414
  
Inhibitor
Name:
BDBM412517
Synonyms:
(8-(2-oxa-5- azabicyclo[2.2.2]octan-5-yl)-3- fluoro-5,11-dihydro-6H- benzo[b]pyrido[2,3- e][1,4]diazepin-6-yl)(1-(2,2,2- trifluoroethyl)piperidin-4- yl)methanone US10399972, Example 9
Type:
Small organic molecule
Emp. Form.:
C26H29F4N5O2
Mol. Mass.:
519.5344
SMILES:
Fc1cnc2Nc3ccc(cc3N(Cc2c1)C(=O)C1CCN(CC(F)(F)F)CC1)N1CC2CCC1CO2
: